GKCmaTV.fr.st / GKC.fr.st Forum Index  
  Search  •  Memberlist  •  Usergroups   •  Register  •  Profile  •  Log in to check your private messages  •  Log in

There is no tips defined in your language

[]

To help us to fill this box, you can create your own tips, or translate the other languaqe's tip

 [xdtv] Pb de compilation View next topic
View previous topic
Post new topicReply to topic
Author Message
Humidifier
Newbie


Joined: 11 Oct 2003
Posts: 11
Location: Ici et ailleurs ...

PostPosted: Friday 28 September 2007 19:18:09 Reply with quoteBack to top

Bonjour à tous,

Ma dernière compilation fonctionnelle date du 070507.
La dernière version du 07/09/07 me donne les erreurs suivantes (j'ai repris ma dernière compil du 070507 et même pb).

Visiblement je dois trouver ce qu'il me manque où ce quels ont été les changements de la Debian, mai un peu d'aide m'éviterai un futur jet de clavier par la fenêtre wink

Merci de votre aide,
Humidifier.

PS: Dernier détail, j'ai beaucoup de segfault pendant la compilation, alors je relance le 'make' et ça progresse ... ???

[...]
In file included from /usr/include/linux/fb.h:5,
from xdtv_v4l-conf.c:42:
/usr/local/include/linux/i2c.h:41:26: error: linux/module.h: Aucun fichier ou répertoire de ce type
/usr/local/include/linux/i2c.h:45:27: error: asm/semaphore.h: Aucun fichier ou répertoire de ce type
In file included from /usr/include/linux/fb.h:5,
from xdtv_v4l-conf.c:42:
/usr/local/include/linux/i2c.h:73: error: array type has incomplete element type
/usr/local/include/linux/i2c.h:89: error: expected '=', ',', ';', 'asm' or '__attribute__' before 'i2c_smbus_xfer'
/usr/local/include/linux/i2c.h:97: error: expected '=', ',', ';', 'asm' or '__attribute__' before 'i2c_smbus_write_quick'
/usr/local/include/linux/i2c.h:98: error: expected '=', ',', ';', 'asm' or '__attribute__' before 'i2c_smbus_read_byte'
/usr/local/include/linux/i2c.h:99: error: expected '=', ',', ';', 'asm' or '__attribute__' before 'i2c_smbus_write_byte'
/usr/local/include/linux/i2c.h:100: error: expected '=', ',', ';', 'asm' or '__attribute__' before 'i2c_smbus_read_byte_data'
/usr/local/include/linux/i2c.h:101: error: expected '=', ',', ';', 'asm' or '__attribute__' before 'i2c_smbus_write_byte_data'
/usr/local/include/linux/i2c.h:103: error: expected '=', ',', ';', 'asm' or '__attribute__' before 'i2c_smbus_read_word_data'
/usr/local/include/linux/i2c.h:104: error: expected '=', ',', ';', 'asm' or '__attribute__' before 'i2c_smbus_write_word_data'
/usr/local/include/linux/i2c.h:106: error: expected '=', ',', ';', 'asm' or '__attribute__' before 'i2c_smbus_process_call'
/usr/local/include/linux/i2c.h:109: error: expected '=', ',', ';', 'asm' or '__attribute__' before 'i2c_smbus_read_block_data'
/usr/local/include/linux/i2c.h:111: error: expected '=', ',', ';', 'asm' or '__attribute__' before 'i2c_smbus_write_block_data'
/usr/local/include/linux/i2c.h:114: error: expected '=', ',', ';', 'asm' or '__attribute__' before 'i2c_smbus_read_i2c_block_data'
/usr/local/include/linux/i2c.h:116: error: expected '=', ',', ';', 'asm' or '__attribute__' before 'i2c_smbus_write_i2c_block_data'
/usr/local/include/linux/i2c.h:205: error: array type has incomplete element type
/usr/local/include/linux/i2c.h:207: error: expected declaration specifiers or '...' before 'u16'
/usr/local/include/linux/i2c.h:209: error: expected declaration specifiers or '...' before 'u8'
/usr/local/include/linux/i2c.h:219: error: expected specifier-qualifier-list before 'u32'
/usr/local/include/linux/i2c.h:247: error: field 'bus' has incomplete type
/usr/local/include/linux/i2c.h:370: error: expected '=', ',', ';', 'asm' or '__attribute__' before 'i2c_get_functionality'
/usr/local/include/linux/i2c.h:373: error: expected declaration specifiers or '...' before 'u32'
/usr/local/include/linux/i2c.h: In function 'i2c_delay':
/usr/local/include/linux/i2c.h:593: error: 'TASK_INTERRUPTIBLE' undeclared (first use in this function)
/usr/local/include/linux/i2c.h:593: error: (Each undeclared identifier is reported only once
/usr/local/include/linux/i2c.h:593: error: for each function it appears in.)
xdtv_v4l-conf.c: In function 'displayinfo_dga':
xdtv_v4l-conf.c:246: warning: pointer targets in passing argument 3 of 'XF86DGAGetVideoLL' differ in signedness
make[3]: *** [xdtv_v4l-conf.o] Erreur 1
make[3]: quittant le répertoire « /usr/local/src/TV/xdtv_070908/src »
make[2]: *** [all-recursive] Erreur 1
make[2]: quittant le répertoire « /usr/local/src/TV/xdtv_070908/src »
make[1]: *** [all-recursive] Erreur 1
make[1]: quittant le répertoire « /usr/local/src/TV/xdtv_070908 »
make: *** [all] Erreur 2

_________________
Debian Sid up-to-date
View user's profileSend private message
Display posts from previous:      
Post new topicReply to topic


 Jump to:   



View next topic
View previous topic
You cannot post new topics in this forum
You cannot reply to topics in this forum
You cannot edit your posts in this forum
You cannot delete your posts in this forum
You cannot vote in polls in this forum


Powered by phpBB © 200-2008 phpBB Group :: FI Theme :: All times are GMT + 1 Hour