GKCmaTV.fr.st / GKC.fr.st Forum Index  
  Search  •  Memberlist  •  Usergroups   •  Register  •  Profile  •  Log in to check your private messages  •  Log in

There is no tips defined in your language

[]

To help us to fill this box, you can create your own tips, or translate the other languaqe's tip

 Xdtv Son ok mais Ecran noir View next topic
View previous topic
Post new topicReply to topic
Author Message
Nad1
Newbie


Joined: 13 Jun 2007
Posts: 5

PostPosted: Wednesday 13 June 2007 23:16:53 Reply with quoteBack to top

Bonjour, j'ai installé la derniere version de xdtv (2.4).

Je capte bien toutes les chaines hertziennes, le son marche nikel mais pas l'image triste

Quelqu'un a une idée pour résoudre ce probleme ?

Pour info lorsque je lance xdtv j'obtiens ces messages :

Code:

This is xdtv 2.4.0 running on Linux/i686 (2.6.22-6-generic).
scandir: Aucun fichier ou répertoire de ce type
filename = /home/nadir/.xdtv/xdtvrc
X Error of failed request:  XF86DGANoDirectVideoMode
  Major opcode of failed request:  136 (XFree86-DGA)
  Minor opcode of failed request:  1 (XF86DGAGetVideoLL)
  Serial number of failed request:  13
  Current serial number in output stream:  13
xdtv_v4l-conf had some trouble, trying to continue anyway
xinerama 0: 1280x1024+0+0
Warning: Missing charsets in String to FontSet conversion
wmhooks: netwm detected
wmhooks: netwm state above supported
wmhooks: netwm fullscreen supported
wmhooks: nothing found...
DGA: server=2.0, include=2.0
VidMode: server=2.2, include=2.2
  available video mode(s): 1280x1024 1024x768 832x624 800x600 720x400 640x480 1280x1024 1280x960 1280x800 1280x768 1152x864 1024x768 1024x768 960x600 896x672 840x525 800x600 800x600 800x600 800x600 800x600 800x512 720x450 640x512 640x512 640x480 640x480 640x480 640x400 640x384 576x432 512x384 512x384 512x384 416x312 400x300 400x300 400x300 400x300 320x240 320x240 320x240
XvGrabPort() failed, on XvImage port 355, may be used by another application.
Selected XvImage adaptor with yuyv support: NV17 Video Texture on port 356 (grabdisplay)
XvGrabPort() failed, on XvImage port 387, may be used by another application.
Selected XvImage adaptor with yuyv support: NV05 Video Blitter on port 388 (grabdisplay)
No XvVideo port available.
ioctl VIDIOC_G_FBUF: Argument invalide
classical overlay is disabled*** GRABBER DEVICE TYPE = v4l2
Warning: Cannot convert string "-xxl-ledfixed-medium-r-semicondensed--39-120-75-75-c-180-*-*" to type FontStruct
Warning: Missing charsets in String to FontSet conversion
MMX, SSE, AMD MMX extensions, SSE2, have been detected.
Method mmx
*** AUDIO DEVICE TYPE = alsa
*** MIXER DEVICE TYPE = alsa
ioctl VIDIOC_STREAMON: Argument invalide
ioctl VIDIOC_REQBUFS: Périphérique ou ressource occupé


Merci.

Carte tv : Wintv PCi fm Chip 881
View user's profileSend private message
pingus
Dévelo XdTV (Linux)


Joined: 21 Dec 2002
Posts: 194

PostPosted: Tuesday 26 June 2007 18:50:09 Reply with quoteBack to top

tu as mal configuré ta carte TV et ton tuner
=> http://linuxtv.org/v4lwiki/index.php/Main_Page

Pingus
View user's profileSend private message
Nad1
Newbie


Joined: 13 Jun 2007
Posts: 5

PostPosted: Monday 2 July 2007 21:09:48 Reply with quoteBack to top

Salut j'ai bien regardé la wiki que tu m'as envoyé et j'avous que c'est un peu trouble. Je ne m'y connait pas bien et je n'arrive pas a voir comment configurer la carte correctement.

Par contre je ne comprend pas pourquoi tout marche niquel avec xawtv si il y a un problème de configuration de ma carte TV triste

Merci pour l'aide en tout cas.
View user's profileSend private message
Nad1
Newbie


Joined: 13 Jun 2007
Posts: 5

PostPosted: Saturday 27 October 2007 17:18:51 Reply with quoteBack to top

up ?
View user's profileSend private message
pingus
Dévelo XdTV (Linux)


Joined: 21 Dec 2002
Posts: 194

PostPosted: Sunday 28 October 2007 08:40:08 Reply with quoteBack to top

la 2.4.0 ne marche pas sur les derniers kernels
passe a la 2.4.1cvs (sur sf.net/projects/xawdecode)
View user's profileSend private message
Nad1
Newbie


Joined: 13 Jun 2007
Posts: 5

PostPosted: Sunday 28 October 2007 12:06:09 Reply with quoteBack to top

salut merci pour la réponse.

J'essaye de compiler la version 2.4.1cvs3, le ./configure se passe bien par contre je rencontre pas mal d'erreur lors du make.

Code:
alevtparams_ui.c:29:27: erreur: X11/Intrinsic.h : Aucun fichier ou répertoire de ce type
alevtparams_ui.c:30:28: erreur: X11/StringDefs.h : Aucun fichier ou répertoire de ce type
alevtparams_ui.c:31:23: erreur: X11/Shell.h : Aucun fichier ou répertoire de ce type
alevtparams_ui.c:32:29: erreur: X11/Xaw/XawInit.h : Aucun fichier ou répertoire de ce type
alevtparams_ui.c:33:29: erreur: X11/Xaw/Command.h : Aucun fichier ou répertoire de ce type
alevtparams_ui.c:34:27: erreur: X11/Xaw/Label.h : Aucun fichier ou répertoire de ce type
alevtparams_ui.c:35:27: erreur: X11/Xaw/Paned.h : Aucun fichier ou répertoire de ce type
alevtparams_ui.c:36:31: erreur: X11/Xaw/AsciiText.h : Aucun fichier ou répertoire de ce type
In file included from alevtparams_ui.c:43:
xdtv.h:31: erreur: expected «)" before «widget"
xdtv.h:32: erreur: expected «)" before «widget"
xdtv.h:33: erreur: expected «)" before «widget"
In file included from alevtparams_ui.c:45:
x11.h:38: erreur: expected «=", «,", «;", «asm" or «__attribute__" before «*" token
x11.h:39: erreur: expected «)" before «*" token
x11.h:40: erreur: expected «=", «,", «;", «asm" or «__attribute__" before «x11_create_pixmap"
x11.h:53: erreur: expected «=", «,", «;", «asm" or «__attribute__" before «video_init"
x11.h:55: erreur: expected «)" before «*" token
x11.h:57: erreur: expected «)" before «*" token
x11.h:66: erreur: expected «=", «,", «;", «asm" or «__attribute__" before «colormap"
x11.h:67: erreur: expected «=", «,", «;", «asm" or «__attribute__" before «*" token
x11.h:68: erreur: expected «=", «,", «;", «asm" or «__attribute__" before «*" token
In file included from alevtparams_ui.c:46:
toolbox.h:27: erreur: expected «=", «,", «;", «asm" or «__attribute__" before «left_ptr"
toolbox.h:28: erreur: expected «=", «,", «;", «asm" or «__attribute__" before «menu_ptr"
toolbox.h:29: erreur: expected «=", «,", «;", «asm" or «__attribute__" before «qu_ptr"
toolbox.h:30: erreur: expected «=", «,", «;", «asm" or «__attribute__" before «no_ptr"
toolbox.h:32: erreur: expected «=", «,", «;", «asm" or «__attribute__" before «bm_yes"
toolbox.h:33: erreur: expected «=", «,", «;", «asm" or «__attribute__" before «bm_no"
toolbox.h:39: erreur: expected «=", «,", «;", «asm" or «__attribute__" before «add_pulldown_menu"
toolbox.h:40: erreur: expected «=", «,", «;", «asm" or «__attribute__" before «add_menu_entry"
toolbox.h:41: erreur: expected «=", «,", «;", «asm" or «__attribute__" before «add_menu_sep"
toolbox.h:43: erreur: expected «)" before «char"
toolbox.h:44: erreur: expected «)" before «widget"
toolbox.h:45: erreur: expected «)" before «widget"
toolbox.h:46: erreur: expected «)" before «shell"
toolbox.h:47: erreur: expected «)" before «widget"
toolbox.h:49: erreur: expected «)" before «widget"
toolbox.h:51: erreur: expected «)" before «widget"
toolbox.h:53: attention : noms de paramètres (sans type) dans la déclaration de fonction
toolbox.h:55: erreur: expected «)" before «char"
toolbox.h:57: erreur: expected «)" before «char"
toolbox.h:58: erreur: expected «)" before «char"
toolbox.h:60: erreur: expected «)" before «widget"
toolbox.h:62: erreur: expected «)" before «widget"
toolbox.h:64: erreur: expected «)" before «widget"
toolbox.h:67: attention : noms de paramètres (sans type) dans la déclaration de fonction
toolbox.h:68: attention : noms de paramètres (sans type) dans la déclaration de fonction
In file included from popup_ui.h:30,
                 from alevtparams_ui.c:47:
stringuty.h:64: erreur: expected «=", «,", «;", «asm" or «__attribute__" before «lines2string"
stringuty.h:66: erreur: expected «=", «,", «;", «asm" or «__attribute__" before «lines4textString"
stringuty.h:69: erreur: expected «)" before «*" token
In file included from alevtparams_ui.c:47:
popup_ui.h:35: erreur: expected «)" before «app_context"
popup_ui.h:37: erreur: expected «)" before «widget"
Dans le fichier inclus à partir de alevtparams_ui.c:63:
pixmaps_loader.h:37:31: erreur: X11/Xaw/Scrollbar.h : Aucun fichier ou répertoire de ce type
pixmaps_loader.h:38:30: erreur: X11/Xaw/Viewport.h : Aucun fichier ou répertoire de ce type
pixmaps_loader.h:39:25: erreur: X11/Xaw/Box.h : Aucun fichier ou répertoire de ce type
alevtparams_ui.c:65: erreur: expected «)" before «widget"
alevtparams_ui.c:66: erreur: expected «)" before «XEvent"
alevtparams_ui.c:67: erreur: expected «)" before «XEvent"
alevtparams_ui.c:68: erreur: expected «)" before «XEvent"
alevtparams_ui.c:69: erreur: expected «)" before «widget"
alevtparams_ui.c:70: erreur: expected «=", «,", «;", «asm" or «__attribute__" before «app_shell"
alevtparams_ui.c:85: erreur: expected «=", «,", «;", «asm" or «__attribute__" before «alevtparams_shell"
alevtparams_ui.c:86: erreur: expected «=", «,", «;", «asm" or «__attribute__" before «alevtparams_paned"
alevtparams_ui.c:87: erreur: expected «=", «,", «;", «asm" or «__attribute__" before «c_finetune_mode"
alevtparams_ui.c:88: erreur: expected «=", «,", «;", «asm" or «__attribute__" before «c_alevtaction"
alevtparams_ui.c:89: erreur: expected «=", «,", «;", «asm" or «__attribute__" before «c_openalevt"
alevtparams_ui.c:90: erreur: expected «=", «,", «;", «asm" or «__attribute__" before «c_error_reduction"
alevtparams_ui.c:91: erreur: expected «=", «,", «;", «asm" or «__attribute__" before «c_error_bell"
alevtparams_ui.c:92: erreur: expected «=", «,", «;", «asm" or «__attribute__" before «c_charset"
alevtparams_ui.c:93: erreur: expected «=", «,", «;", «asm" or «__attribute__" before «c_vbioffset"
alevtparams_ui.c:94: erreur: expected «=", «,", «;", «asm" or «__attribute__" before «t_finetune_str"
alevtparams_ui.c:95: erreur: expected «=", «,", «;", «asm" or «__attribute__" before «t_defaultpage_str"
alevtparams_ui.c:96: erreur: expected «=", «,", «;", «asm" or «__attribute__" before «c_defaultpage"
alevtparams_ui.c:97: erreur: expected «=", «,", «;", «asm" or «__attribute__" before «c_alevtparams"
alevtparams_ui.c:98: erreur: expected «=", «,", «;", «asm" or «__attribute__" before «c_finetune"
alevtparams_ui.c:99: erreur: expected «=", «,", «;", «asm" or «__attribute__" before «c_alevtparamssave"
alevtparams_ui.c:148: erreur: expected «)" before «widget"
alevtparams_ui.c:154: erreur: expected «)" before «widget"
alevtparams_ui.c:214: erreur: expected «)" before «widget"
alevtparams_ui.c: In function «create_alevtparamswin":
alevtparams_ui.c:311: erreur: «Widget" undeclared (first use in this function)
alevtparams_ui.c:311: erreur: (Each undeclared identifier is reported only once
alevtparams_ui.c:311: erreur: for each function it appears in.)
alevtparams_ui.c:311: erreur: expected «;" before «c"
alevtparams_ui.c:321: erreur: «alevtparams_shell" undeclared (first use in this function)
alevtparams_ui.c:321: attention : implicit declaration of function «XtVaAppCreateShell"
alevtparams_ui.c:322: erreur: «topLevelShellWidgetClass" undeclared (first use in this function)
alevtparams_ui.c:323: erreur: «XtNclientLeader" undeclared (first use in this function)
alevtparams_ui.c:323: erreur: «app_shell" undeclared (first use in this function)
alevtparams_ui.c:323: erreur: «XtNvisual" undeclared (first use in this function)
alevtparams_ui.c:323: erreur: «vinfo" undeclared (first use in this function)
alevtparams_ui.c:324: erreur: «XtNcolormap" undeclared (first use in this function)
alevtparams_ui.c:324: erreur: «colormap" undeclared (first use in this function)
alevtparams_ui.c:324: erreur: «XtNdepth" undeclared (first use in this function)
alevtparams_ui.c:327: erreur: «alevtparams_paned" undeclared (first use in this function)
alevtparams_ui.c:328: attention : implicit declaration of function «XtVaCreateManagedWidget"
alevtparams_ui.c:328: erreur: «panedWidgetClass" undeclared (first use in this function)
alevtparams_ui.c:331: erreur: «c_defaultpage" undeclared (first use in this function)
alevtparams_ui.c:331: erreur: «labelWidgetClass" undeclared (first use in this function)
alevtparams_ui.c:332: erreur: «XtNallowResize" undeclared (first use in this function)
alevtparams_ui.c:332: erreur: «XtNshowGrip" undeclared (first use in this function)
alevtparams_ui.c:332: erreur: «XtNskipAdjust" undeclared (first use in this function)
alevtparams_ui.c:334: erreur: «t_defaultpage_str" undeclared (first use in this function)
alevtparams_ui.c:334: erreur: «c" undeclared (first use in this function)
alevtparams_ui.c:334: erreur: «asciiTextWidgetClass" undeclared (first use in this function)
alevtparams_ui.c:335: erreur: «XtNtype" undeclared (first use in this function)
alevtparams_ui.c:335: erreur: «XawAsciiString" undeclared (first use in this function)
alevtparams_ui.c:336: attention : implicit declaration of function «strcmp"
alevtparams_ui.c:337: attention : implicit declaration of function «XtVaSetValues"
alevtparams_ui.c:337: erreur: «XtNstring" undeclared (first use in this function)
alevtparams_ui.c:337: attention : implicit declaration of function «strdup"
alevtparams_ui.c:337: attention : incompatible implicit declaration of built-in function «strdup"
alevtparams_ui.c:340: erreur: «c_finetune" undeclared (first use in this function)
alevtparams_ui.c:344: erreur: «c_finetune_mode" undeclared (first use in this function)
alevtparams_ui.c:344: erreur: «commandWidgetClass" undeclared (first use in this function)
alevtparams_ui.c:346: attention : implicit declaration of function «XtAddCallback"
alevtparams_ui.c:346: erreur: «XtNcallback" undeclared (first use in this function)
alevtparams_ui.c:346: erreur: «alevtparams_menu_cb" undeclared (first use in this function)
alevtparams_ui.c:346: erreur: «XtPointer" undeclared (first use in this function)
alevtparams_ui.c:346: erreur: expected «)" before «ALEVT_FINETUNE_MODE"
alevtparams_ui.c:349: erreur: «XtNlabel" undeclared (first use in this function)
alevtparams_ui.c:351: erreur: «t_finetune_str" undeclared (first use in this function)
alevtparams_ui.c:356: erreur: «XtNsensitive" undeclared (first use in this function)
alevtparams_ui.c:360: erreur: «c_alevtparams" undeclared (first use in this function)
alevtparams_ui.c:364: erreur: «c_error_reduction" undeclared (first use in this function)
alevtparams_ui.c:366: erreur: expected «)" before «ALEVT_ERROR_REDUCTION"
alevtparams_ui.c:372: erreur: «c_error_bell" undeclared (first use in this function)
alevtparams_ui.c:374: erreur: expected «)" before «ALEVT_ERROR_BELL"
alevtparams_ui.c:380: erreur: «c_charset" undeclared (first use in this function)
alevtparams_ui.c:382: erreur: expected «)" before «ALEVT_CHARSET"
alevtparams_ui.c:388: erreur: «c_vbioffset" undeclared (first use in this function)
alevtparams_ui.c:390: erreur: expected «)" before «ALEVT_VBIOFFSET"
alevtparams_ui.c:396: erreur: «c_alevtaction" undeclared (first use in this function)
alevtparams_ui.c:397: erreur: «save_cb" undeclared (first use in this function)
alevtparams_ui.c:398: erreur: «close_alevtparamswin" undeclared (first use in this function)
alevtparams_ui.c:399: erreur: «action_cb" undeclared (first use in this function)
alevtparams_ui.c:403: erreur: «c_openalevt" undeclared (first use in this function)
alevtparams_ui.c:408: erreur: «c_alevtparamssave" undeclared (first use in this function)
alevtparams_ui.c:421: attention : implicit declaration of function «XtDisplay"
alevtparams_ui.c:421: attention : implicit declaration of function «XtScreen"
alevtparams_ui.c:421: erreur: invalid type argument of «->"
alevtparams_ui.c:421: attention : passing argument 1 of «create_alevt_pixmaps" makes pointer from integer without a cast
alevtparams_ui.c: In function «update_defaultpage":
alevtparams_ui.c:426: erreur: «t_defaultpage_str" undeclared (first use in this function)
alevtparams_ui.c:427: attention : implicit declaration of function «XtVaGetValues"
alevtparams_ui.c:427: erreur: «XtNstring" undeclared (first use in this function)
alevtparams_ui.c: In function «update_finetune":
alevtparams_ui.c:432: erreur: «t_finetune_str" undeclared (first use in this function)
alevtparams_ui.c:433: erreur: «XtNstring" undeclared (first use in this function)
make[3]: *** [alevtparams_ui.o] Erreur 1
make[2]: *** [all-recursive] Erreur 1
make[1]: *** [all-recursive] Erreur 1
make: *** [all] Erreur 2


Serais-tu d'ou cela peut venir ?

Merci.
View user's profileSend private message
BlindMan
Modérateur


Joined: 06 Apr 2002
Posts: 9962

PostPosted: Sunday 28 October 2007 20:28:02 Reply with quoteBack to top

Il manque des fichiers de développement (paquets -dev ou -devel suivant la distrib) au moins pour la bibliothèque xaw ... sans doute pour d'autres paquets également.
View user's profileSend private messageVisit poster's website
Nad1
Newbie


Joined: 13 Jun 2007
Posts: 5

PostPosted: Tuesday 30 October 2007 18:53:13 Reply with quoteBack to top

Merci, j'ai enfin réussi à le compiler, ce qui a réglé mon problème d'écran noir.

J'essaye maintenant de régler un problème de son, sur canal+ (en clair) il y en a pas et sur les autres on entend pas mal mais le son reste saturé.

J'ai aussi un probleme de fullscreen, qui ne s'étend pas à tout l'écran mais au max a 768x576. J'ai essayé de modifier plusieurs parametres dans les options X11 mais rien à faire. j'ai lu la fac qui mentionne ce problème sur le site de xawdecode "http://xawdecode.sourceforge.net/htmlpageFR/indexFR.shtml" mais je trouve pas la solution. Si vous avez une idée ?

Merci pour votre aide.
View user's profileSend private message
Display posts from previous:      
Post new topicReply to topic


 Jump to:   



View next topic
View previous topic
You cannot post new topics in this forum
You cannot reply to topics in this forum
You cannot edit your posts in this forum
You cannot delete your posts in this forum
You cannot vote in polls in this forum


Powered by phpBB © 200-2008 phpBB Group :: FI Theme :: All times are GMT + 1 Hour